BDBM240924 US9409892, 19
SMILES OC(=O)C1(CNC(=O)c2nc(C#N)c3cc(Oc4ccccc4)ccc3c2O)CCCC1
InChI Key InChIKey=JSYWJICQZNCWHF-UHFFFAOYSA-N
Data  2 IC50
  Tab Delimited (TSV)   2D SDfile   Computed 3D by Vconf -m prep SDfile
Find this compound or compounds like it in BindingDB:
Activity Spreadsheet -- Enzyme Inhibition Constant Data from BindingDB
Found 1 hit for monomerid = 240924
TargetProlyl hydroxylase EGLN2(Homo sapiens (Human))
Fibrogen
US Patent
LigandPNGBDBM240924(US9409892, 19)
Affinity DataIC50:  1.73E+3nMpH: 7.4Assay Description:Ketoglutaric acid α-[1-14C]-sodium salt, alpha-ketoglutaric acid sodium salt, and HPLC purified peptide may be obtained from commercial sources...
Ligand InfoPC cidPC sid
In DepthDetails US Patent